{"text_format":"1","workbook":"xlsx","n_sheets":4,"sheets":["ASHE Energy to Care","Talking Points","Key","test"],"not_rendered":{"charts":0,"images":3,"macros":1,"external_links":0,"defined_names":1,"comments":1,"pivot_tables":0},"unopened":[],"bounds":{"document_bytes":16777216,"sheet_cells":100000,"rows_first":2000,"rows_last":500,"rows_between":2000,"halvings":0,"cell_chars":16384,"cell_head_chars":4096},"cells_cut":0,"cells_raw":0,"read":"whole","date_system":"1900"}

{"sheet":"ASHE Energy to Care","index":0,"n_rows":37,"n_cols":5,"rows_kept":37,"cut":false,"hidden":false,"merged":[[6,0,7,1],[21,2,21,5],[2,2,2,5],[5,2,5,5],[11,2,11,5]]}
[]
[]
["                                                     ",null,"Energy to Care Benefits Calculator Tool"]
[]
[]
[null,null,"SELECT INPUTS"]
[null,null,"Select either bed capacity OR ",0]
[null,null,"Floor area (ft2) of your hospital",0]
[null,null,"Select your state","Alabama"]
[null,null,"Enter hospital's annual energy costs  ($)"]
{"$rows_left_out":28}
{"sheet":"Talking Points","index":1,"n_rows":52,"n_cols":10,"rows_kept":52,"cut":false,"hidden":true,"merged":[]}
[null,"% of Coal Mix (EIA 2017)","PM2.5 (lb/MWh)","Nox (lb/MWh)","CO2 (lbs/MWh)","Region","cents/kwh","$/capita health benefits","Natural Gas Emission Factors"]
["Alabama",0.22,0.1,0.91,1502,"SE",4.0199999999999996,105.54,"We used EPA emission factors for small controlled low Nox burners"]
["Alaska",0.09,"NA","NA","NA",null,null,"NA","Nox (lb/10x6 scf)",50]
["Arizona",0.3,7.0000000000000007E-2,0.96,1317,"SW",1.62,8.59,"CO2(lb/10 x 6 scf)",120000]
["Arkansas",0.43,0.1,0.91,1502,"SE",4.0199999999999996,98.39,"PM (lb/10x6 scf)",7.6]
["California",0,0.05,0.33,1087,"CA",1.08,4.4800000000000004,"https://www3.epa.gov/ttnchie1/ap42/ch01/final/c01s04.pdf"]
["Colorado",0.54,0.04,1.37,1672,"RM",2.3199999999999998,16.559999999999999]
["Connecticut",0.01,0.04,0.42,1114,"NE",3.73,75.040000000000006,"Convert to therms"]
["Delaware",0.05,0.21,0.97,1675,"GL",7.95,103.42,"Nox (lb/therm)",{"$f":"(J3/1000000)/1.037","v":4.8216007714561243E-5}]
["District of Columbia","NA",0.21,0.97,1675,"GL",7.95,63.3,"CO2 (lb/therm)",{"$f":"(J4/1000000)/1.037","v":0.11571841851494696}]
{"$rows_left_out":43}
{"sheet":"Key","index":2,"n_rows":79,"n_cols":11,"rows_kept":79,"cut":false,"hidden":true,"merged":[]}
["Hospital Bed Capacity",{"$f":"'ASHE Energy to Care'!D7","v":0},{"$f":"VLOOKUP(B1,Table1[#All],2,TRUE)","v":"BedA"},null,null,"Reduction in  EUI (kBtu/ft²)","ENERGY STAR Score","Site energy use (kBtu)","Electric use savings (kWh)","Gas use savings (therms)"]
["Area of the hospital",{"$f":"'ASHE Energy to Care'!D8","v":0},{"$f":"VLOOKUP(B2,Table2[#All],2,TRUE)","v":{"$error":"#N/A"}}]
["State","='Input sheet '!D6",null,null,"hospital #1",{"$f":"INDEX(test!$AG$3:$AG$238, MATCH(0, IF($B$7=test!$AX$3:$AX$238, COUNTIF($F$2:$F2, test!$AG$3:$AG$238), \"\"), 0))","v":{"$error":"#N/A"}},{"$f":"INDEX(test!$AA$3:$AA$238, MATCH(0, IF($B$7=test!$AX$3:$AX$238, COUNTIF($G$2:$G2, test!$AA$3:$AA$238), \"\"), 0))","v":{"$error":"#N/A"}},{"$f":"INDEX(test!$AC$3:$AC$238, MATCH(0, IF($B$7=test!$AX$3:$AX$238, COUNTIF($H$2:$H2, test!$AC$3:$AC$238), \"\"), 0))","v":{"$error":"#N/A"}},{"$f":"INDEX(test!$U$3:$U$238, MATCH(0, IF($B$7=test!$AX$3:$AX$238, COUNTIF($I$2:$I2, test!$U$3:$U$238), \"\"), 0))","v":{"$error":"#N/A"}},{"$f":"INDEX(test!$X$3:$X$238, MATCH(0, IF($B$7=test!$AX$3:$AX$238, COUNTIF($J$2:$J2, test!$X$3:$X$238), \"\"), 0))","v":{"$error":"#N/A"}}]
[null,null,null,null,"hospital #2",{"$f":"INDEX(test!$AG$3:$AG$238, MATCH(0, IF($B$7=test!$AX$3:$AX$238, COUNTIF($F$2:$F3, test!$AG$3:$AG$238), \"\"), 0))","v":{"$error":"#N/A"}},{"$f":"INDEX(test!$AA$3:$AA$238, MATCH(0, IF($B$7=test!$AX$3:$AX$238, COUNTIF($G$2:$G3, test!$AA$3:$AA$238), \"\"), 0))","v":{"$error":"#N/A"}},{"$f":"INDEX(test!$AC$3:$AC$238, MATCH(0, IF($B$7=test!$AX$3:$AX$238, COUNTIF($H$2:$H3, test!$AC$3:$AC$238), \"\"), 0))","v":{"$error":"#N/A"}},{"$f":"INDEX(test!$U$3:$U$238, MATCH(0, IF($B$7=test!$AX$3:$AX$238, COUNTIF($I$2:$I3, test!$U$3:$U$238), \"\"), 0))","v":{"$error":"#N/A"}},{"$f":"INDEX(test!$X$3:$X$238, MATCH(0, IF($B$7=test!$AX$3:$AX$238, COUNTIF($J$2:$J3, test!$X$3:$X$238), \"\"), 0))","v":{"$error":"#N/A"}}]
["ASHE Chapter",{"$f":"'ASHE Energy to Care'!D11","v":"Region4"},null,null,"hospital #3",{"$f":"INDEX(test!$AG$3:$AG$238, MATCH(0, IF($B$7=test!$AX$3:$AX$238, COUNTIF($F$2:$F4, test!$AG$3:$AG$238), \"\"), 0))","v":{"$error":"#N/A"}},{"$f":"INDEX(test!$AA$3:$AA$238, MATCH(0, IF($B$7=test!$AX$3:$AX$238, COUNTIF($G$2:$G4, test!$AA$3:$AA$238), \"\"), 0))","v":{"$error":"#N/A"}},{"$f":"INDEX(test!$AC$3:$AC$238, MATCH(0, IF($B$7=test!$AX$3:$AX$238, COUNTIF($H$2:$H4, test!$AC$3:$AC$238), \"\"), 0))","v":{"$error":"#N/A"}},{"$f":"INDEX(test!$U$3:$U$238, MATCH(0, IF($B$7=test!$AX$3:$AX$238, COUNTIF($I$2:$I4, test!$U$3:$U$238), \"\"), 0))","v":{"$error":"#N/A"}},{"$f":"INDEX(test!$X$3:$X$238, MATCH(0, IF($B$7=test!$AX$3:$AX$238, COUNTIF($J$2:$J4, test!$X$3:$X$238), \"\"), 0))","v":{"$error":"#N/A"}}]
["Check - if Region 10 with no winners, borrow from Region 9",{"$f":"IF(B5=\"Region10\",\"Region9\",B5)","v":"Region4"},null,null,"hospital #4",{"$f":"INDEX(test!$AG$3:$AG$238, MATCH(0, IF($B$7=test!$AX$3:$AX$238, COUNTIF($F$2:$F5, test!$AG$3:$AG$238), \"\"), 0))","v":{"$error":"#N/A"}},{"$f":"INDEX(test!$AA$3:$AA$238, MATCH(0, IF($B$7=test!$AX$3:$AX$238, COUNTIF($G$2:$G5, test!$AA$3:$AA$238), \"\"), 0))","v":{"$error":"#N/A"}},{"$f":"INDEX(test!$AC$3:$AC$238, MATCH(0, IF($B$7=test!$AX$3:$AX$238, COUNTIF($H$2:$H5, test!$AC$3:$AC$238), \"\"), 0))","v":{"$error":"#N/A"}},{"$f":"INDEX(test!$U$3:$U$238, MATCH(0, IF($B$7=test!$AX$3:$AX$238, COUNTIF($I$2:$I5, test!$U$3:$U$238), \"\"), 0))","v":{"$error":"#N/A"}},{"$f":"INDEX(test!$X$3:$X$238, MATCH(0, IF($B$7=test!$AX$3:$AX$238, COUNTIF($J$2:$J5, test!$X$3:$X$238), \"\"), 0))","v":{"$error":"#N/A"}}]
["Combined Key",{"$f":"IF(B1>0,CONCATENATE(C1,B6),CONCATENATE(C2,B6))","v":{"$error":"#N/A"}},null,null,"hospital #5",{"$f":"INDEX(test!$AG$3:$AG$238, MATCH(0, IF($B$7=test!$AX$3:$AX$238, COUNTIF($F$2:$F6, test!$AG$3:$AG$238), \"\"), 0))","v":{"$error":"#N/A"}},{"$f":"INDEX(test!$AA$3:$AA$238, MATCH(0, IF($B$7=test!$AX$3:$AX$238, COUNTIF($G$2:$G6, test!$AA$3:$AA$238), \"\"), 0))","v":{"$error":"#N/A"}},{"$f":"INDEX(test!$AC$3:$AC$238, MATCH(0, IF($B$7=test!$AX$3:$AX$238, COUNTIF($H$2:$H6, test!$AC$3:$AC$238), \"\"), 0))","v":{"$error":"#N/A"}},{"$f":"INDEX(test!$U$3:$U$238, MATCH(0, IF($B$7=test!$AX$3:$AX$238, COUNTIF($I$2:$I6, test!$U$3:$U$238), \"\"), 0))","v":{"$error":"#N/A"}},{"$f":"INDEX(test!$X$3:$X$238, MATCH(0, IF($B$7=test!$AX$3:$AX$238, COUNTIF($J$2:$J6, test!$X$3:$X$238), \"\"), 0))","v":{"$error":"#N/A"}}]
[null,null,null,null,"hospital #6",{"$f":"INDEX(test!$AG$3:$AG$238, MATCH(0, IF($B$7=test!$AX$3:$AX$238, COUNTIF($F$2:$F7, test!$AG$3:$AG$238), \"\"), 0))","v":{"$error":"#N/A"}},{"$f":"INDEX(test!$AA$3:$AA$238, MATCH(0, IF($B$7=test!$AX$3:$AX$238, COUNTIF($G$2:$G7, test!$AA$3:$AA$238), \"\"), 0))","v":{"$error":"#N/A"}},{"$f":"INDEX(test!$AC$3:$AC$238, MATCH(0, IF($B$7=test!$AX$3:$AX$238, COUNTIF($H$2:$H7, test!$AC$3:$AC$238), \"\"), 0))","v":{"$error":"#N/A"}},{"$f":"INDEX(test!$U$3:$U$238, MATCH(0, IF($B$7=test!$AX$3:$AX$238, COUNTIF($I$2:$I7, test!$U$3:$U$238), \"\"), 0))","v":{"$error":"#N/A"}},{"$f":"INDEX(test!$X$3:$X$238, MATCH(0, IF($B$7=test!$AX$3:$AX$238, COUNTIF($J$2:$J7, test!$X$3:$X$238), \"\"), 0))","v":{"$error":"#N/A"}}]
[null,null,null,null,"hospital #7",{"$f":"INDEX(test!$AG$3:$AG$238, MATCH(0, IF($B$7=test!$AX$3:$AX$238, COUNTIF($F$2:$F8, test!$AG$3:$AG$238), \"\"), 0))","v":{"$error":"#N/A"}},{"$f":"INDEX(test!$AA$3:$AA$238, MATCH(0, IF($B$7=test!$AX$3:$AX$238, COUNTIF($G$2:$G8, test!$AA$3:$AA$238), \"\"), 0))","v":{"$error":"#N/A"}},{"$f":"INDEX(test!$AC$3:$AC$238, MATCH(0, IF($B$7=test!$AX$3:$AX$238, COUNTIF($H$2:$H8, test!$AC$3:$AC$238), \"\"), 0))","v":{"$error":"#N/A"}},{"$f":"INDEX(test!$U$3:$U$238, MATCH(0, IF($B$7=test!$AX$3:$AX$238, COUNTIF($I$2:$I8, test!$U$3:$U$238), \"\"), 0))","v":{"$error":"#N/A"}},{"$f":"INDEX(test!$X$3:$X$238, MATCH(0, IF($B$7=test!$AX$3:$AX$238, COUNTIF($J$2:$J8, test!$X$3:$X$238), \"\"), 0))","v":{"$error":"#N/A"}}]
[null,null,null,null,"hospital #8",{"$f":"INDEX(test!$AG$3:$AG$238, MATCH(0, IF($B$7=test!$AX$3:$AX$238, COUNTIF($F$2:$F9, test!$AG$3:$AG$238), \"\"), 0))","v":{"$error":"#N/A"}},{"$f":"INDEX(test!$AA$3:$AA$238, MATCH(0, IF($B$7=test!$AX$3:$AX$238, COUNTIF($G$2:$G9, test!$AA$3:$AA$238), \"\"), 0))","v":{"$error":"#N/A"}},{"$f":"INDEX(test!$AC$3:$AC$238, MATCH(0, IF($B$7=test!$AX$3:$AX$238, COUNTIF($H$2:$H9, test!$AC$3:$AC$238), \"\"), 0))","v":{"$error":"#N/A"}},{"$f":"INDEX(test!$U$3:$U$238, MATCH(0, IF($B$7=test!$AX$3:$AX$238, COUNTIF($I$2:$I9, test!$U$3:$U$238), \"\"), 0))","v":{"$error":"#N/A"}},{"$f":"INDEX(test!$X$3:$X$238, MATCH(0, IF($B$7=test!$AX$3:$AX$238, COUNTIF($J$2:$J9, test!$X$3:$X$238), \"\"), 0))","v":{"$error":"#N/A"}}]
{"$rows_left_out":70}
{"sheet":"test","index":3,"n_rows":120,"n_cols":60,"rows_kept":120,"cut":false,"hidden":true,"merged":[]}
["ACEEE Data - Hospital (General Medical & Surgical) for tool"]
["Property Id","Property Name","Parent Property Name","Year Ending","City","Postal Code","Number of Buildings","Year Built","Occupancy","Metered Areas (Energy)","Metered Areas  (Water)","Hospital (General Medical & Surgical) - Gross Floor Area (ft²)","Area Key","Hospital (General Medical & Surgical) - Licensed Bed Capacity","Bed Key","Hospital (General Medical & Surgical) - Number of MRI Machines","Hospital (General Medical & Surgical) - Onsite Laundry Facility","Other - Specialty Hospital - Gross Floor Area (ft²)","Other - Specialty Hospital - Weekly Operating Hours","Electricity Use - Grid Purchase (kWh)","One year electricity use savings","Electricity Use – Generated from Onsite Renewable Systems and Used Onsite (kWh)","Electricity Use - Grid Purchase and Generated from Onsite Renewable Systems (kWh)","Natural Gas Use (therms)","One year natural gas use savings","Diesel #2 Use (kBtu)","ENERGY STAR Score","Site EUI (kBtu/ft²)","Site Energy Use (kBtu)",null,"Site Energy Use - Adjusted to Current Year (kBtu)","Weather Normalized Site EUI (kBtu/ft²)","Weather normalized EUI % reduction","Weather Normalized Water/Wastewater Site EUI (kBtu/gpd)","Water Use (All Water Sources) (kgal)","Energy Cost ($)","Energy Cost Intensity ($/ft²)","Total Water Cost (All Water Sources) ($)","Total Water Cost Intensity (All Water Sources) ($/ft²)","Investment in Energy Projects, Cumulative ($)","Estimated Savings from Energy Projects, Cumulative ($)","Green Power - Onsite and Offsite (kWh)","Avoided Emissions - Onsite and Offsite Green Power (Metric Tons CO2e)","Total GHG Emissions (Metric Tons CO2e)","Direct GHG Emissions (Metric Tons CO2e)","Indirect GHG Emissions (Metric Tons CO2e)","Net Emissions (Metric Tons CO2e)","State/Province","Region Key","Combined Key",null,null,null,"Number of EtC winners","Energy savings ","Winning hospital in the region","State"]
["28405","Westchester Division","Not Applicable: Standalone Property","2013-12-31","White Plains","10605",0,"1930",100,"Whole Building","Whole Building",602980,{"$f":"VLOOKUP(L3,Table2[#All],2,TRUE)","v":"AreaE"},416.06,{"$f":"VLOOKUP(N3,Table1[#All],2,TRUE)","v":"BedC"},1,"No","Not Available","Not Available",6210737.9000000004,-178817.70000000019,"Not Available",6210739,860167.10149999999,-39703.329400000046,"Not Available",99,182.9,110304374.40000001,-6.4616090846815633E-2,111307476.7,188.2,2.4870466321243581E-2,"Not Available","Not Available","Not Available","Not Available","Not Available","Not Available",0,0,0,0,6593.2,4798.6000000000004,1794.7,6593.2,"New York",{"$f":"VLOOKUP(AV3,Table3[#All],2,FALSE)","v":"Region1"},{"$f":"IF(Key!$B$1>0,CONCATENATE(O3,AW3),CONCATENATE(M3,AW3))","v":"AreaERegion1"},null,null,"Region1",{"$f":"COUNTIF(AW:AW,BA3)","v":11},{"$f":"MAX(IF(AW:AW=BA3,AG:AG))","v":0.35117773019271897},{"$f":"INDEX(B:B,MATCH(BC3,AG:AG,0))","v":"Russell Regional Hospital"},{"$f":"INDEX(AV:AV,MATCH(BC3,AG:AG,0))","v":"Kansas"},null,null,{"$f":"MAX(IF(AW3:AW120=BA3,AG3:AG120))","v":0.35117773019271897}]
[28405,"Westchester Division","Not Applicable: Standalone Property","2007-12-31","White Plains",10605,0,1930,100,"Whole Building","Whole Building",602980,{"$f":"VLOOKUP(L4,Table2[#All],2,TRUE)","v":"AreaE"},416.06,{"$f":"VLOOKUP(N4,Table1[#All],2,TRUE)","v":"BedC"},1,"No","Not Available","Not Available",6488139.4000000004,-523900.20000000019,"Not Available",6488140,671879.98640000005,128414.98329999996,"Not Available",99,189.9,114499532.40000001,6.3662623282587288E-2,115607430,189.9,6.3609467455621321E-2,"Not Available","Not Available","Not Available","Not Available","Not Available","Not Available",0,0,0,0,7311.6,5436.8,1874.8,7311.6,"New York",{"$f":"VLOOKUP(AV4,Table3[#All],2,FALSE)","v":"Region1"},{"$f":"IF(Key!$B$1>0,CONCATENATE(O4,AW4),CONCATENATE(M4,AW4))","v":"AreaERegion1"},null,null,"Region2",{"$f":"COUNTIF(AW:AW,BA4)","v":5},{"$f":"MAX(IF(AW:AW=BA4,AG:AG))","v":0.12591986917416184},{"$f":"INDEX(B:B,MATCH(BC4,AG:AG,0))","v":"Wellspan Surgery and Rehab Hospital"},{"$f":"INDEX(AV:AV,MATCH(BC4,AG:AG,0))","v":"Pennsylvania"},null,null,{"$f":"MAX(IF(AW3:AW120=BA4,AG3:AG120))","v":0}]
["28405","Westchester Division","Not Applicable: Standalone Property","2006-12-31","White Plains","10605",0,"1930",100,"Whole Building","Whole Building",602980,{"$f":"VLOOKUP(L5,Table2[#All],2,TRUE)","v":"AreaE"},416.06,{"$f":"VLOOKUP(N5,Table1[#All],2,TRUE)","v":"BedC"},1,"No","Not Available","Not Available",5964239.2000000002,-301119.90000000037,"Not Available",5964240,800294.96970000002,-98045.766640000045,"Not Available",98,202.8,122284483.40000001,-6.1806146997628493E-2,123630590.90000001,202.8,-6.1780104712041942E-2,"Not Available","Not Available","Not Available","Not Available","Not Available","Not Available",0,0,0,0,7599.7,5876.3,1723.4,7599.7,"New York",{"$f":"VLOOKUP(AV5,Table3[#All],2,FALSE)","v":"Region1"},{"$f":"IF(Key!$B$1>0,CONCATENATE(O5,AW5),CONCATENATE(M5,AW5))","v":"AreaERegion1"},null,null,"Region3",21,{"$f":"MAX(IF(AW:AW=BA5,AG:AG))","v":0.19701395650762743},{"$f":"INDEX(B:B,MATCH(BC5,AG:AG,0))","v":"CHS Pineville"},"North Carolina"]
["4743676","Wellspan Surgery and Rehab Hospital","Not Applicable: Standalone Property","2016-12-31","York","17403",1,"1960",100,"Whole Building","Whole Building",146000,{"$f":"VLOOKUP(L6,Table2[#All],2,TRUE)","v":"AreaB"},103.78,{"$f":"VLOOKUP(N6,Table1[#All],2,TRUE)","v":"BedB"},0,"No","Not Available","Not Available",3822066.1,319958.5,"Not Available",3822067,177994.1961,38863.39360000001,"Not Available",51,211.2,30840310.600000001,0.13898011401351912,30511361,213.8,0.12591986917416184,"Not Available","Not Available",431329.03,2.95,"Not Available","Not Available",0,0,0,0,2266.6,945.4,1321.2,2266.6,"Pennsylvania",{"$f":"VLOOKUP(AV6,Table3[#All],2,FALSE)","v":"Region2"},{"$f":"IF(Key!$B$1>0,CONCATENATE(O6,AW6),CONCATENATE(M6,AW6))","v":"AreaBRegion2"},null,null,"Region4",2,{"$f":"MAX(IF(AW:AW=BA6,AG:AG))","v":7.6627218934911173E-2},"UF Health Shands Cancer Hospital","Florida"]
["1721339","University of Arkansas for Medical Sciences","Not Applicable: Standalone Property","2009-12-31","Little Rock","72205",42,"1955",100,"Whole Building","Not Available",3732417,{"$f":"VLOOKUP(L7,Table2[#All],2,TRUE)","v":"AreaF"},470,{"$f":"VLOOKUP(N7,Table1[#All],2,TRUE)","v":"BedC"},8,"No","Not Available","Not Available",150376277.5,-9115871,"Not Available",150376300,4988564.1911599999,-291205.41717000026,"Not Available",13,245.4,936250066.60000002,-1.7709865699693784E-2,967441246.79999995,244.5,0.21230670103092777,"Not Available","Not Available",12134907.5,3.18,"Not Available","Not Available",0,0,0,0,79417.100000000006,26496.7,52920.5,79417.100000000006,"Arkansas",{"$f":"VLOOKUP(AV7,Table3[#All],2,FALSE)","v":"Region7"},{"$f":"IF(Key!$B$1>0,CONCATENATE(O7,AW7),CONCATENATE(M7,AW7))","v":"AreaFRegion7"},null,null,"Region5",36,{"$f":"MAX(IF(AW:AW=BA7,AG:AG))","v":0.29347284504235166},"Barnesville Hospital","Ohio"]
["3297548","University Hospital","Not Applicable: Standalone Property","2017-12-31","Madison","537921525",1,"1979",100,"Whole Building","Whole Building",1738623,{"$f":"VLOOKUP(L8,Table2[#All],2,TRUE)","v":"AreaF"},679,{"$f":"VLOOKUP(N8,Table1[#All],2,TRUE)","v":"BedD"},5,"No","Not Available","Not Available",44288251.799999997,776433.70000000298,"Not Available",44288260,"Not Available",{"$error":"#VALUE!"},"Not Available",22,307.89999999999998,535283479.30000001,0.11072329052880296,539968776.5,310.8,0.11123820417500709,"Not Available",40441.199999999997,6122813.0099999998,3.52,198712.68,0.11,0,0,0,0,57318.9,0,57318.9,57318.9,"Wisconsin",{"$f":"VLOOKUP(AV8,Table3[#All],2,FALSE)","v":"Region6"},{"$f":"IF(Key!$B$1>0,CONCATENATE(O8,AW8),CONCATENATE(M8,AW8))","v":"AreaFRegion6"},null,null,"Region6",9,{"$f":"MAX(IF(AW:AW=BA8,AG:AG))","v":0.14055793991416318},"Aurora Medical Center - Summit","Wisconsin"]
["4431897","UF Health Shands Cancer Hospital","Not Applicable: Standalone Property","2017-12-31","Gainesville","32608",2,"1958",100,"Whole Building","Not Available",546365,{"$f":"VLOOKUP(L9,Table2[#All],2,TRUE)","v":"AreaE"},345,{"$f":"VLOOKUP(N9,Table1[#All],2,TRUE)","v":"BedC"},1,"No","Not Available","Not Available",16906964.899999999,167960,"Not Available",16906970,11898.00006,-1268.9995099999996,"Not Available",16,318.2,232353138.59999999,5.0039446972629173E-2,232353133,312.10000000000002,7.6627218934911173E-2,"Not Available","Not Available",4828291.42,6.61,"Not Available","Not Available",0,0,0,0,"Not Available",63.2,"Not Available",0,"Florida",{"$f":"VLOOKUP(AV9,Table3[#All],2,FALSE)","v":"Region4"},{"$f":"IF(Key!$B$1>0,CONCATENATE(O9,AW9),CONCATENATE(M9,AW9))","v":"AreaERegion4"},"BedDAreaERegion5",null,"Region7",27,{"$f":"MAX(IF(AW:AW=BA9,AG:AG))","v":0.32246849196001737},"Memorial Hermann Katy Hospital","Texas"]
[1159992,"Thompson Health Main Campus","Not Applicable: Standalone Property","2007-12-31","Canandaigua",14424,3,1969,85,"Whole Building","Not Available",381540,{"$f":"VLOOKUP(L10,Table2[#All],2,TRUE)","v":"AreaD"},307.10000000000002,{"$f":"VLOOKUP(N10,Table1[#All],2,TRUE)","v":"BedC"},1,"No","Not Available","Not Available",7932641.0999999996,252768.20000000019,"Not Available",7932642,552518.97979999997,-1465.9656999999424,"Not Available",78,215.8,82318072.700000003,6.3196586603560437E-2,91772627.5,214.9,6.0751748251748276E-2,"Not Available",24088.799999999999,1231121.5900000001,3.23,81231.09,0.21,50350,25814,0,0,3999.5,2934.7,1064.8,3999.5,"New York",{"$f":"VLOOKUP(AV10,Table3[#All],2,FALSE)","v":"Region1"},{"$f":"IF(Key!$B$1>0,CONCATENATE(O10,AW10),CONCATENATE(M10,AW10))","v":"AreaDRegion1"},null,null,"Region8",2,{"$f":"MAX(IF(AW:AW=BA10,AG:AG))","v":0.35117773019271897},"Russell Regional Hospital","Kansas"]
{"$rows_left_out":110}